Target
Sodium-dependent dopamine transporter
Ligand
BDBM50062912
Substrate
Ki
57±n/a nM
Comments
PDSP_1229
Citation
 Ukairo, OTBondi, CDNewman, AHKulkarni, SSKozikowski, APPan, SSurratt, CK Recognition of benztropine by the dopamine transporter (DAT) differs from that of the classical dopamine uptake inhibitors cocaine, methylphenidate, and mazindol as a function of a DAT transmembrane 1 aspartic acid residue. J Pharmacol Exp Ther 314:575-83 (2005)  
Target
Name:
Sodium-dependent dopamine transporter
Synonyms:
DA transporter SC6A3_RAT Sodium-dependent dopamine transporter | Sodium-dependent dopamine transporter (DAT)
Type:
Multi-pass membrane protein
Mol. Mass.:
68749.45
Organism:
Rattus norvegicus (rat)
Description:
P23977
Residue:
619
  
Inhibitor
Name:
BDBM50062912
Synonyms:
CHEMBL796 alpha-phenyl-2-piperidineacetic acid methyl ester methyl alpha-phenyl-alpha-2-piperidinylacetate methyl phenyl(piperidin-2-yl)acetate | methylphenidan
Type:
Small organic molecule
Emp. Form.:
C14H19NO2
Mol. Mass.:
233.3062
SMILES:
COC(=O)C(C1CCCCN1)c1ccccc1
: