Target
D(3) dopamine receptor
Ligand
BDBM81486
Substrate
Ki
0.1±n/a nM
Comments
PDSP_1249
Citation
 Burstein, ESMa, JWong, SGao, YPham, EKnapp, AENash, NROlsson, RDavis, REHacksell, UWeiner, DMBrann, MR Intrinsic efficacy of antipsychotics at human D2, D3, and D4 dopamine receptors: identification of the clozapine metabolite N-desmethylclozapine as a D2/D3 partial agonist. J Pharmacol Exp Ther 315:1278-87 (2005)  
Target
Name:
D(3) dopamine receptor
Synonyms:
DOPAMINE D3 DRD3_HUMAN Dopamine D3 receptor (D3) Dopamine receptor Dopamine receptor D3
Type:
Mol. Mass.:
44243.43
Organism:
Homo sapiens (Human)
Description:
Residue:
400
  
Inhibitor
Name:
BDBM81486
Synonyms:
CAS_1050-79-9 NSC_4249
Type:
Small organic molecule
Emp. Form.:
C22H26FNO2
Mol. Mass.:
355.4457
SMILES:
Cc1ccc(cc1)C1(O)CCN(CCCC(=O)c2ccc(F)cc2)CC1
: