Target
Delta-type opioid receptor
Ligand
BDBM86260
Substrate
Ki
33±n/a nM
Comments
PDSP_2
Citation
 Le Bourdonnec, BBarker, WMBelanger, SWiant, DDConway-James, NCCassel, JAO'Neill, TJLittle, PJDeHaven, RNDeHaven-Hudkins, DLDolle, RE Novel trans-3,4-dimethyl-4-(3-hydroxyphenyl)piperidines as mu opioid receptor antagonists with improved opioid receptor selectivity profiles. Bioorg Med Chem Lett 18:2006-12 (2008)  
Target
Name:
Delta-type opioid receptor
Synonyms:
D-OR-1 Delta opioid receptor OPIATE Delta OPRD1 OPRK1 | opioid receptor, delta 1
Type:
G Protein-Coupled Receptor (GPCR)
Mol. Mass.:
40382.98
Organism:
Homo sapiens (Human)
Description:
Competition binding assays were carried out using membrane preparations from transfected HN9.10 cells that constitutively expressed the delta opioid receptor.
Residue:
372
  
Inhibitor
Name:
BDBM86260
Synonyms:
CAS_465-65-6 NSC_10064 | Naloxone(-)
Type:
Small organic molecule
Emp. Form.:
C19H21NO4
Mol. Mass.:
327.3743
SMILES:
Oc1ccc2CC3N(CC=C)CCC45C(Oc1c24)C(=O)CCC35O
: