Target
6-phosphogluconate dehydrogenase, decarboxylating
Ligand
BDBM50043906
Substrate
Meas. Tech.
Enzyme Assay
Ki
3144600±208100 nM
IC50
1410000±0.0 nM
Citation
 Bülbül, MErat, M Investigation of the effects of some sulfonamide derivatives on the activities of glucose-6-phosphate dehydrogenase, 6-phospho gluconate dehydrogenase and glutathione reductase from human erythrocytes. J Enzyme Inhib Med Chem 23:418-23 (2008)  
Target
Name:
6-phosphogluconate dehydrogenase, decarboxylating
Synonyms:
6-phosphogluconate dehydrogenase 6PGD_HUMAN PGDH
Type:
Protein
Mol. Mass.:
53143.42
Organism:
Homo sapiens (Human)
Description:
P52209
Residue:
483
  
Inhibitor
Name:
BDBM50043906
Synonyms:
CHEMBL269001 MK-507 | US10172837, Dorzolamide
Type:
Small organic molecule
Emp. Form.:
C10H16N2O4S3
Mol. Mass.:
324.44
SMILES:
CCNC1CC(C)S(=O)(=O)c2sc(cc12)S(N)(=O)=O
: