Target
DNA dC->dU-editing enzyme APOBEC-3G
Ligand
BDBM1025
Substrate
Meas. Tech.
SAR analysis of small molecule inhibitors of APOBEC3G DNA Deaminase via a fluorescence-based single-stranded DNA deaminase assay
Temperature
298.15±n/a K
IC50
>99000±n/a nM
Comments
extracted
Citation
 PubChem, PC SAR analysis of small molecule inhibitors of APOBEC3G DNA Deaminase via a fluorescence-based single-stranded DNA deaminase assay PubChem Bioassay (2011)[AID] 
Target
Name:
DNA dC->dU-editing enzyme APOBEC-3G
Synonyms:
ABC3G_HUMAN | APOBEC3G
Type:
Enzyme Catalytic Domain
Mol. Mass.:
46419.54
Organism:
Homo sapiens (Human)
Description:
gi_13399304
Residue:
384
  
Inhibitor
Name:
BDBM1025
Synonyms:
cid_17450753
Type:
Emp. Form.:
C18H19FN4O2S
Mol. Mass.:
374.432
SMILES:
CN(Cc1ccc(C)o1)C(=O)CSc1nnc(-c2ccc(F)cc2)n1C
: