Target
DNA dC->dU-editing enzyme APOBEC-3G
Ligand
BDBM1282
Substrate
Meas. Tech.
SAR analysis of small molecule inhibitors of APOBEC3G DNA Deaminase via a fluorescence-based single-stranded DNA deaminase assay
Temperature
298.15±n/a K
IC50
>99000±n/a nM
Comments
extracted
Citation
 PubChem, PC SAR analysis of small molecule inhibitors of APOBEC3G DNA Deaminase via a fluorescence-based single-stranded DNA deaminase assay PubChem Bioassay (2011)[AID] 
Target
Name:
DNA dC->dU-editing enzyme APOBEC-3G
Synonyms:
ABC3G_HUMAN | APOBEC3G
Type:
Enzyme Catalytic Domain
Mol. Mass.:
46419.54
Organism:
Homo sapiens (Human)
Description:
gi_13399304
Residue:
384
  
Inhibitor
Name:
BDBM1282
Synonyms:
cid_1883569
Type:
Emp. Form.:
C21H29N3O
Mol. Mass.:
339.4745
SMILES:
CN1CC2=C(N=C1NCCCO)c1ccccc1CC21CCCCC1
: