Target
DNA dC->dU-editing enzyme APOBEC-3G
Ligand
BDBM87079
Substrate
Meas. Tech.
SAR analysis of small molecule inhibitors of APOBEC3G DNA Deaminase via a fluorescence-based single-stranded DNA deaminase assay
Temperature
298.15±n/a K
IC50
>99000±n/a nM
Comments
extracted
Citation
 PubChem, PC SAR analysis of small molecule inhibitors of APOBEC3G DNA Deaminase via a fluorescence-based single-stranded DNA deaminase assay PubChem Bioassay (2011)[AID] 
Target
Name:
DNA dC->dU-editing enzyme APOBEC-3G
Synonyms:
ABC3G_HUMAN | APOBEC3G
Type:
Enzyme Catalytic Domain
Mol. Mass.:
46419.54
Organism:
Homo sapiens (Human)
Description:
gi_13399304
Residue:
384
  
Inhibitor
Name:
BDBM87079
Synonyms:
2-N-(3,4-dichlorophenyl)-4-N-(4-fluorophenyl)-6-morpholin-4-yl-1,3,5-triazine-2,4-diamine N2-(3,4-dichlorophenyl)-N4-(4-fluorophenyl)-6-(4-morpholinyl)-1,3,5-triazine-2,4-diamine [4-(3,4-dichloroanilino)-6-morpholino-s-triazin-2-yl]-(4-fluorophenyl)amine | cid_18580166
Type:
Small organic molecule
Emp. Form.:
C19H17Cl2FN6O
Mol. Mass.:
435.282
SMILES:
Fc1ccc(Nc2nc(Nc3ccc(Cl)c(Cl)c3)nc(n2)N2CCOCC2)cc1
: