Target
DNA dC->dU-editing enzyme APOBEC-3G
Ligand
BDBM87083
Substrate
Meas. Tech.
SAR analysis of small molecule inhibitors of APOBEC3G DNA Deaminase via a fluorescence-based single-stranded DNA deaminase assay
Temperature
298.15±n/a K
IC50
>99000±n/a nM
Comments
extracted
Citation
 PubChem, PC SAR analysis of small molecule inhibitors of APOBEC3G DNA Deaminase via a fluorescence-based single-stranded DNA deaminase assay PubChem Bioassay (2011)[AID] 
Target
Name:
DNA dC->dU-editing enzyme APOBEC-3G
Synonyms:
ABC3G_HUMAN | APOBEC3G
Type:
Enzyme Catalytic Domain
Mol. Mass.:
46419.54
Organism:
Homo sapiens (Human)
Description:
gi_13399304
Residue:
384
  
Inhibitor
Name:
BDBM87083
Synonyms:
2-[[5-(3-chloranyl-6-methoxy-1-benzothiophen-2-yl)-4-methyl-1,2,4-triazol-3-yl]sulfanyl]-1-(4-fluorophenyl)ethanone 2-[[5-(3-chloro-6-methoxy-1-benzothiophen-2-yl)-4-methyl-1,2,4-triazol-3-yl]thio]-1-(4-fluorophenyl)ethanone MLS-0463465.0001 | cid_1178613
Type:
Small organic molecule
Emp. Form.:
C20H15ClFN3O2S2
Mol. Mass.:
447.933
SMILES:
COc1ccc2c(Cl)c(sc2c1)-c1nnc(SCC(=O)c2ccc(F)cc2)n1C
: