Target
DNA dC->dU-editing enzyme APOBEC-3G
Ligand
BDBM87114
Substrate
Meas. Tech.
SAR analysis of small molecule inhibitors of APOBEC3G DNA Deaminase via a fluorescence-based single-stranded DNA deaminase assay
Temperature
298.15±n/a K
IC50
51600±n/a nM
Comments
extracted
Citation
 PubChem, PC SAR analysis of small molecule inhibitors of APOBEC3G DNA Deaminase via a fluorescence-based single-stranded DNA deaminase assay PubChem Bioassay (2011)[AID] 
Target
Name:
DNA dC->dU-editing enzyme APOBEC-3G
Synonyms:
ABC3G_HUMAN | APOBEC3G
Type:
Enzyme Catalytic Domain
Mol. Mass.:
46419.54
Organism:
Homo sapiens (Human)
Description:
gi_13399304
Residue:
384
  
Inhibitor
Name:
BDBM87114
Synonyms:
5-(5-butylsulfanyl-4-methyl-1,2,4-triazol-3-yl)-1-methyl-3-(trifluoromethyl)thieno[2,3-c]pyrazole MLS-0092069.0001 | cid_3598783
Type:
Small organic molecule
Emp. Form.:
C14H16F3N5S2
Mol. Mass.:
375.436
SMILES:
CCCCSc1nnc(-c2cc3c(nn(C)c3s2)C(F)(F)F)n1C
: