Target
DNA dC->dU-editing enzyme APOBEC-3G
Ligand
BDBM50704
Substrate
Meas. Tech.
SAR analysis of small molecule inhibitors of APOBEC3G DNA Deaminase via a fluorescence-based single-stranded DNA deaminase assay
Temperature
298.15±n/a K
IC50
2910±n/a nM
Comments
extracted
Citation
 PubChem, PC SAR analysis of small molecule inhibitors of APOBEC3G DNA Deaminase via a fluorescence-based single-stranded DNA deaminase assay PubChem Bioassay (2011)[AID] 
Target
Name:
DNA dC->dU-editing enzyme APOBEC-3G
Synonyms:
ABC3G_HUMAN | APOBEC3G
Type:
Enzyme Catalytic Domain
Mol. Mass.:
46419.54
Organism:
Homo sapiens (Human)
Description:
gi_13399304
Residue:
384
  
Inhibitor
Name:
BDBM50704
Synonyms:
5-[1-(3-Chloro-propyl)-2,3-dihydro-1H-indol-5-ylmethylene]-2-thioxo-dihydro-pyrimidine-4,6-dione 5-[[1-(3-chloropropyl)-2,3-dihydroindol-5-yl]methylidene]-2-sulfanylidene-1,3-diazinane-4,6-dione MLS000333298 cid_1629947
Type:
Small organic molecule
Emp. Form.:
C16H16ClN3O2S
Mol. Mass.:
349.835
SMILES:
Cl[#6]-[#6]-[#6]-[#7]-1-[#6]-[#6]-c2cc(\[#6]=[#6]-3/[#6](=O)-[#7]-[#6](=S)-[#7]-[#6]-3=O)ccc-12
: