Target
Phospholipase D2
Ligand
BDBM87136
Substrate
Meas. Tech.
Cellular PLD2 concentration response
IC50
370±n/a nM
Citation
 PubChem, PC Cellular PLD2 concentration response PubChem Bioassay (2011)[AID] 
Target
Name:
Phospholipase D2
Synonyms:
PLD2 Phospholipase D2 phospholipase D2 isoform PLD2A
Type:
Protein
Mol. Mass.:
106002.47
Organism:
Homo sapiens (Human)
Description:
Residue:
933
  
Inhibitor
Name:
BDBM87136
Synonyms:
4-chloro-N-[2-[1-(3,4-difluorophenyl)-4-keto-1,3,8-triazaspiro[4.5]decan-8-yl]ethyl]benzamide;2,2,2-trifluoroacetic acid N-[2-[1-[3,4-bis(fluoranyl)phenyl]-4-oxidanylidene-1,3,8-triazaspiro[4.5]decan-8-yl]ethyl]-4-chloranyl-benzamide;2,2,2-tris(fluoranyl)ethanoic acid cid_53469904
Type:
Small organic molecule
Emp. Form.:
C22H23ClF2N4O2
Mol. Mass.:
448.893
SMILES:
Fc1ccc(cc1F)N1CNC(=O)C11CCN(CCNC(=O)c2ccc(Cl)cc2)CC1
: