Target
Phospholipase D2
Ligand
BDBM87140
Substrate
Meas. Tech.
Cellular PLD2 concentration response
IC50
635±n/a nM
Citation
 PubChem, PC Cellular PLD2 concentration response PubChem Bioassay (2011)[AID] 
Target
Name:
Phospholipase D2
Synonyms:
PLD2 Phospholipase D2 phospholipase D2 isoform PLD2A
Type:
Protein
Mol. Mass.:
106002.47
Organism:
Homo sapiens (Human)
Description:
Residue:
933
  
Inhibitor
Name:
BDBM87140
Synonyms:
4-chloranyl-N-[2-[1-(4-chlorophenyl)-4-oxidanylidene-1,3,8-triazaspiro[4.5]decan-8-yl]ethyl]benzamide;2,2,2-tris(fluoranyl)ethanoic acid 4-chloro-N-[2-[1-(4-chlorophenyl)-4-oxo-1,3,8-triazaspiro[4.5]decan-8-yl]ethyl]benzamide;2,2,2-trifluoroacetic acid cid_53469907
Type:
Small organic molecule
Emp. Form.:
C22H24Cl2N4O2
Mol. Mass.:
447.358
SMILES:
Clc1ccc(cc1)N1CNC(=O)C11CCN(CCNC(=O)c2ccc(Cl)cc2)CC1
: