Target
Phospholipase D2
Ligand
BDBM87143
Substrate
Meas. Tech.
Cellular PLD2 concentration response
IC50
4200±n/a nM
Citation
 PubChem, PC Cellular PLD2 concentration response PubChem Bioassay (2011)[AID] 
Target
Name:
Phospholipase D2
Synonyms:
PLD2 Phospholipase D2 phospholipase D2 isoform PLD2A
Type:
Protein
Mol. Mass.:
106002.47
Organism:
Homo sapiens (Human)
Description:
Residue:
933
  
Inhibitor
Name:
BDBM87143
Synonyms:
1-[2-(2-naphthoylamino)ethyl]-N-[2-(2-pyridyl)ethyl]isonipecotamide;2,2,2-trifluoroacetic acid 1-[2-(naphthalene-2-carbonylamino)ethyl]-N-(2-pyridin-2-ylethyl)piperidine-4-carboxamide;2,2,2-trifluoroacetic acid VU0405258-1 | cid_53469915
Type:
Small organic molecule
Emp. Form.:
C26H30N4O2
Mol. Mass.:
430.542
SMILES:
O=C(NCCc1ccccn1)C1CCN(CCNC(=O)c2ccc3ccccc3c2)CC1
: