Target
Phospholipase D2
Ligand
BDBM87150
Substrate
Meas. Tech.
Cellular PLD2 concentration response
IC50
1500±n/a nM
Citation
 PubChem, PC Cellular PLD2 concentration response PubChem Bioassay (2011)[AID] 
Target
Name:
Phospholipase D2
Synonyms:
PLD2 Phospholipase D2 phospholipase D2 isoform PLD2A
Type:
Protein
Mol. Mass.:
106002.47
Organism:
Homo sapiens (Human)
Description:
Residue:
933
  
Inhibitor
Name:
BDBM87150
Synonyms:
N-[(1S)-1-[(4-keto-1-phenyl-1,3,8-triazaspiro[4.5]decan-8-yl)methyl]-2-methyl-propyl]-2-naphthamide;2,2,2-trifluoroacetic acid N-[(2S)-3-methyl-1-(4-oxo-1-phenyl-1,3,8-triazaspiro[4.5]decan-8-yl)butan-2-yl]-2-naphthalenecarboxamide;2,2,2-trifluoroacetic acid VU0404347-1 | cid_53469936
Type:
Small organic molecule
Emp. Form.:
C29H34N4O2
Mol. Mass.:
470.6059
SMILES:
CC(C)[C@@H](CN1CCC2(CC1)N(CNC2=O)c1ccccc1)NC(=O)c1ccc2ccccc2c1
: