Target
Phospholipase D2
Ligand
BDBM87155
Substrate
Meas. Tech.
Cellular PLD2 concentration response
IC50
76±n/a nM
Citation
 PubChem, PC Cellular PLD2 concentration response PubChem Bioassay (2011)[AID] 
Target
Name:
Phospholipase D2
Synonyms:
PLD2 Phospholipase D2 phospholipase D2 isoform PLD2A
Type:
Protein
Mol. Mass.:
106002.47
Organism:
Homo sapiens (Human)
Description:
Residue:
933
  
Inhibitor
Name:
BDBM87155
Synonyms:
N-[(1S)-2-[1-(3,4-difluorophenyl)-4-keto-1,3,8-triazaspiro[4.5]decan-8-yl]-1-methyl-ethyl]quinoline-3-carboxamide;2,2,2-trifluoroacetic acid N-[(2S)-1-[1-(3,4-difluorophenyl)-4-oxo-1,3,8-triazaspiro[4.5]decan-8-yl]propan-2-yl]quinoline-3-carboxamide;2,2,2-trifluoroacetic acid VU0404356-1 | cid_53469954
Type:
Small organic molecule
Emp. Form.:
C26H27F2N5O2
Mol. Mass.:
479.5217
SMILES:
C[C@@H](CN1CCC2(CC1)N(CNC2=O)c1ccc(F)c(F)c1)NC(=O)c1cnc2ccccc2c1
: