Target
Phospholipase D2
Ligand
BDBM87172
Substrate
Meas. Tech.
Cellular PLD2 concentration response
IC50
1300±n/a nM
Citation
 PubChem, PC Cellular PLD2 concentration response PubChem Bioassay (2011)[AID] 
Target
Name:
Phospholipase D2
Synonyms:
PLD2 Phospholipase D2 phospholipase D2 isoform PLD2A
Type:
Protein
Mol. Mass.:
106002.47
Organism:
Homo sapiens (Human)
Description:
Residue:
933
  
Inhibitor
Name:
BDBM87172
Synonyms:
6-fluoranyl-N-[2-[4-(2-oxidanylidene-3H-benzimidazol-1-yl)piperidin-1-yl]ethyl]pyridine-2-carboxamide;2,2,2-tris(fluoranyl)ethanoic acid 6-fluoro-N-[2-[4-(2-oxo-3H-benzimidazol-1-yl)-1-piperidinyl]ethyl]-2-pyridinecarboxamide;2,2,2-trifluoroacetic acid VU0366529-1 | cid_53469980
Type:
Small organic molecule
Emp. Form.:
C20H22FN5O2
Mol. Mass.:
383.4194
SMILES:
Fc1cccc(n1)C(=O)NCCN1CCC(CC1)n1c2ccccc2[nH]c1=O
: