Target
Phospholipase D2
Ligand
BDBM87177
Substrate
Meas. Tech.
Cellular PLD2 concentration response
IC50
25±n/a nM
Citation
 PubChem, PC Cellular PLD2 concentration response PubChem Bioassay (2011)[AID] 
Target
Name:
Phospholipase D2
Synonyms:
PLD2 Phospholipase D2 phospholipase D2 isoform PLD2A
Type:
Protein
Mol. Mass.:
106002.47
Organism:
Homo sapiens (Human)
Description:
Residue:
933
  
Inhibitor
Name:
BDBM87177
Synonyms:
5-fluoranyl-N-[2-[1-(3-fluorophenyl)-4-oxidanylidene-1,3,8-triazaspiro[4.5]decan-8-yl]ethyl]-1H-indole-2-carboxamide;2,2,2-tris(fluoranyl)ethanoic acid 5-fluoro-N-[2-[1-(3-fluorophenyl)-4-oxo-1,3,8-triazaspiro[4.5]decan-8-yl]ethyl]-1H-indole-2-carboxamide;2,2,2-trifluoroacetic acid VU0366558-1 | cid_46938431
Type:
Small organic molecule
Emp. Form.:
C24H25F2N5O2
Mol. Mass.:
453.4844
SMILES:
Fc1cccc(c1)N1CNC(=O)C11CCN(CCNC(=O)c2cc3cc(F)ccc3[nH]2)CC1
: