Target
Phospholipase D2
Ligand
BDBM50258128
Substrate
Meas. Tech.
Cellular PLD2 concentration response
IC50
140±n/a nM
Citation
 PubChem, PC Cellular PLD2 concentration response PubChem Bioassay (2011)[AID] 
Target
Name:
Phospholipase D2
Synonyms:
PLD2 Phospholipase D2 phospholipase D2 isoform PLD2A
Type:
Protein
Mol. Mass.:
106002.47
Organism:
Homo sapiens (Human)
Description:
Residue:
933
  
Inhibitor
Name:
BDBM50258128
Synonyms:
CHEMBL493010 cid_44573687
Type:
Small organic molecule
Emp. Form.:
C25H25FN4O2
Mol. Mass.:
432.49
SMILES:
Fc1ccc2n(C3CCN(CCNC(=O)c4ccc5ccccc5c4)CC3)c(=O)[nH]c2c1
: