Target
Phospholipase D2
Ligand
BDBM87242
Substrate
Meas. Tech.
Cellular PLD2 concentration response
IC50
420±n/a nM
Citation
 PubChem, PC Cellular PLD2 concentration response PubChem Bioassay (2011)[AID] 
Target
Name:
Phospholipase D2
Synonyms:
PLD2 Phospholipase D2 phospholipase D2 isoform PLD2A
Type:
Protein
Mol. Mass.:
106002.47
Organism:
Homo sapiens (Human)
Description:
Residue:
933
  
Inhibitor
Name:
BDBM87242
Synonyms:
N-[2-[4-(2-keto-3H-benzimidazol-1-yl)piperidino]ethyl]phenanthrene-9-carboxamide N-[2-[4-(2-oxo-3H-benzimidazol-1-yl)-1-piperidinyl]ethyl]-9-phenanthrenecarboxamide VU0221810-1 | cid_53470346
Type:
Small organic molecule
Emp. Form.:
C29H28N4O2
Mol. Mass.:
464.5582
SMILES:
O=C(NCCN1CCC(CC1)n1c2ccccc2[nH]c1=O)c1cc2ccccc2c2ccccc12
: