Target
Phospholipase D2
Ligand
BDBM87243
Substrate
Meas. Tech.
Cellular PLD2 concentration response
IC50
1320±n/a nM
Citation
 PubChem, PC Cellular PLD2 concentration response PubChem Bioassay (2011)[AID] 
Target
Name:
Phospholipase D2
Synonyms:
PLD2 Phospholipase D2 phospholipase D2 isoform PLD2A
Type:
Protein
Mol. Mass.:
106002.47
Organism:
Homo sapiens (Human)
Description:
Residue:
933
  
Inhibitor
Name:
BDBM87243
Synonyms:
3,5-dinitro-N-[2-[4-(2-oxidanylidene-3H-benzimidazol-1-yl)piperidin-1-yl]ethyl]benzamide 3,5-dinitro-N-[2-[4-(2-oxo-3H-benzimidazol-1-yl)piperidin-1-yl]ethyl]benzamide VU0221825-1 | cid_53470355
Type:
Small organic molecule
Emp. Form.:
C21H22N6O6
Mol. Mass.:
454.436
SMILES:
[O-][N+](=O)c1cc(cc(c1)[N+]([O-])=O)C(=O)NCCN1CCC(CC1)n1c2ccccc2[nH]c1=O
: