Target
Phospholipase D2
Ligand
BDBM87240
Substrate
Meas. Tech.
PLD2 purified enzyme concentration response
IC50
2225±n/a nM
Citation
 PubChem, PC PLD2 purified enzyme concentration response PubChem Bioassay (2011)[AID] 
Target
Name:
Phospholipase D2
Synonyms:
PLD2 Phospholipase D2 phospholipase D2 isoform PLD2A
Type:
Protein
Mol. Mass.:
106002.47
Organism:
Homo sapiens (Human)
Description:
Residue:
933
  
Inhibitor
Name:
BDBM87240
Synonyms:
3,4-bis(fluoranyl)-N-[(2S)-1-(4-oxidanylidene-1-phenyl-1,3,8-triazaspiro[4.5]decan-8-yl)propan-2-yl]benzamide;2,2,2-tris(fluoranyl)ethanoic acid 3,4-difluoro-N-[(2S)-1-(4-oxo-1-phenyl-1,3,8-triazaspiro[4.5]decan-8-yl)propan-2-yl]benzamide;2,2,2-trifluoroacetic acid cid_53470310
Type:
Small organic molecule
Emp. Form.:
C23H26F2N4O2
Mol. Mass.:
428.4749
SMILES:
C[C@@H](CN1CCC2(CC1)N(CNC2=O)c1ccccc1)NC(=O)c1ccc(F)c(F)c1
: