Target
Phospholipase D1
Ligand
BDBM87231
Substrate
Meas. Tech.
PLD1 purified enzyme concentration response
IC50
20000±n/a nM
Citation
 PubChem, PC PLD1 purified enzyme concentration response PubChem Bioassay (2011)[AID] 
Target
Name:
Phospholipase D1
Synonyms:
Choline phosphatase 1 PLD1 Phosphatidylcholine-hydrolyzing phospholipase D1 Phospholipase D1 Phospholipase D2 (PLD2) | hPLD1
Type:
Protein
Mol. Mass.:
124219.92
Organism:
Homo sapiens (Human)
Description:
Q13393
Residue:
1074
  
Inhibitor
Name:
BDBM87231
Synonyms:
N-[2-(4-keto-1-phenyl-1,3,8-triazaspiro[4.5]decan-8-yl)ethyl]quinoline-3-carboxamide N-[2-(4-oxidanylidene-1-phenyl-1,3,8-triazaspiro[4.5]decan-8-yl)ethyl]quinoline-3-carboxamide N-[2-(4-oxo-1-phenyl-1,3,8-triazaspiro[4.5]decan-8-yl)ethyl]quinoline-3-carboxamide cid_44138050
Type:
Small organic molecule
Emp. Form.:
C25H27N5O2
Mol. Mass.:
429.5142
SMILES:
O=C(NCCN1CCC2(CC1)N(CNC2=O)c1ccccc1)c1cnc2ccccc2c1
: