Target
Phospholipase D1
Ligand
BDBM87123
Substrate
Meas. Tech.
Cellular PLD1 concentration response
IC50
20000±n/a nM
Citation
 PubChem, PC Cellular PLD1 concentration response PubChem Bioassay (2011)[AID] 
Target
Name:
Phospholipase D1
Synonyms:
Choline phosphatase 1 PLD1 Phosphatidylcholine-hydrolyzing phospholipase D1 Phospholipase D1 Phospholipase D2 (PLD2) | hPLD1
Type:
Protein
Mol. Mass.:
124219.92
Organism:
Homo sapiens (Human)
Description:
Q13393
Residue:
1074
  
Inhibitor
Name:
BDBM87123
Synonyms:
3,4-bis(fluoranyl)-N-[2-[1-(3-fluorophenyl)-4-oxidanylidene-1,3,8-triazaspiro[4.5]decan-8-yl]ethyl]benzamide;2,2,2-tris(fluoranyl)ethanoic acid 3,4-difluoro-N-[2-[1-(3-fluorophenyl)-4-oxo-1,3,8-triazaspiro[4.5]decan-8-yl]ethyl]benzamide;2,2,2-trifluoroacetic acid ML298 (4) cid_53393915
Type:
Small organic molecule
Emp. Form.:
C22H23F3N4O2
Mol. Mass.:
432.4388
SMILES:
Fc1cccc(c1)N1CNC(=O)C11CCN(CCNC(=O)c2ccc(F)c(F)c2)CC1
: