Target
Phospholipase D1
Ligand
BDBM87135
Substrate
Meas. Tech.
Cellular PLD1 concentration response
IC50
2810±n/a nM
Citation
 PubChem, PC Cellular PLD1 concentration response PubChem Bioassay (2011)[AID] 
Target
Name:
Phospholipase D1
Synonyms:
Choline phosphatase 1 PLD1 Phosphatidylcholine-hydrolyzing phospholipase D1 Phospholipase D1 Phospholipase D2 (PLD2) | hPLD1
Type:
Protein
Mol. Mass.:
124219.92
Organism:
Homo sapiens (Human)
Description:
Q13393
Residue:
1074
  
Inhibitor
Name:
BDBM87135
Synonyms:
CHEMBL1254909 N-[2-[1-(3,4-difluorophenyl)-4-oxo-1,3,8-triazaspiro[4.5]decan-8-yl]ethyl]-2-naphthalenecarboxamide;2,2,2-trifluoroacetic acid N-[2-[1-[3,4-bis(fluoranyl)phenyl]-4-oxidanylidene-1,3,8-triazaspiro[4.5]decan-8-yl]ethyl]naphthalene-2-carboxamide;2,2,2-tris(fluoranyl)ethanoic acid cid_46939579
Type:
Small organic molecule
Emp. Form.:
C26H26F2N4O2
Mol. Mass.:
464.507
SMILES:
Fc1ccc(cc1F)N1CNC(=O)C11CCN(CCNC(=O)c2ccc3ccccc3c2)CC1
: