Target
Phospholipase D1
Ligand
BDBM87153
Substrate
Meas. Tech.
Cellular PLD1 concentration response
IC50
26±n/a nM
Citation
 PubChem, PC Cellular PLD1 concentration response PubChem Bioassay (2011)[AID] 
Target
Name:
Phospholipase D1
Synonyms:
Choline phosphatase 1 PLD1 Phosphatidylcholine-hydrolyzing phospholipase D1 Phospholipase D1 Phospholipase D2 (PLD2) | hPLD1
Type:
Protein
Mol. Mass.:
124219.92
Organism:
Homo sapiens (Human)
Description:
Q13393
Residue:
1074
  
Inhibitor
Name:
BDBM87153
Synonyms:
5-fluoranyl-N-[(2S)-3-methyl-1-(4-oxidanylidene-1-phenyl-1,3,8-triazaspiro[4.5]decan-8-yl)butan-2-yl]-1H-indole-2-carboxamide;2,2,2-tris(fluoranyl)ethanoic acid 5-fluoro-N-[(2S)-3-methyl-1-(4-oxo-1-phenyl-1,3,8-triazaspiro[4.5]decan-8-yl)butan-2-yl]-1H-indole-2-carboxamide;2,2,2-trifluoroacetic acid cid_53469946
Type:
Small organic molecule
Emp. Form.:
C27H32FN5O2
Mol. Mass.:
477.5737
SMILES:
CC(C)[C@@H](CN1CCC2(CC1)N(CNC2=O)c1ccccc1)NC(=O)c1cc2cc(F)ccc2[nH]1
: