Target
Phospholipase D1
Ligand
BDBM87154
Substrate
Meas. Tech.
Cellular PLD1 concentration response
IC50
1500±n/a nM
Citation
 PubChem, PC Cellular PLD1 concentration response PubChem Bioassay (2011)[AID] 
Target
Name:
Phospholipase D1
Synonyms:
Choline phosphatase 1 PLD1 Phosphatidylcholine-hydrolyzing phospholipase D1 Phospholipase D1 Phospholipase D2 (PLD2) | hPLD1
Type:
Protein
Mol. Mass.:
124219.92
Organism:
Homo sapiens (Human)
Description:
Q13393
Residue:
1074
  
Inhibitor
Name:
BDBM87154
Synonyms:
N-[2-[4-(2-keto-3-methyl-benzimidazol-1-yl)piperidino]ethyl]-2-naphthamide;2,2,2-trifluoroacetic acid N-[2-[4-(3-methyl-2-oxo-1-benzimidazolyl)-1-piperidinyl]ethyl]-2-naphthalenecarboxamide;2,2,2-trifluoroacetic acid VU0404353-1 | cid_53469948
Type:
Small organic molecule
Emp. Form.:
C26H28N4O2
Mol. Mass.:
428.5261
SMILES:
Cn1c2ccccc2n(C2CCN(CCNC(=O)c3ccc4ccccc4c3)CC2)c1=O
: