Target
Phospholipase D1
Ligand
BDBM87167
Substrate
Meas. Tech.
Cellular PLD1 concentration response
IC50
5900±n/a nM
Citation
 PubChem, PC Cellular PLD1 concentration response PubChem Bioassay (2011)[AID] 
Target
Name:
Phospholipase D1
Synonyms:
Choline phosphatase 1 PLD1 Phosphatidylcholine-hydrolyzing phospholipase D1 Phospholipase D1 Phospholipase D2 (PLD2) | hPLD1
Type:
Protein
Mol. Mass.:
124219.92
Organism:
Homo sapiens (Human)
Description:
Q13393
Residue:
1074
  
Inhibitor
Name:
BDBM87167
Synonyms:
CHEMBL1254082 N-[2-[1-(4-bromophenyl)-4-oxidanylidene-1,3,8-triazaspiro[4.5]decan-8-yl]ethyl]naphthalene-2-carboxamide;2,2,2-tris(fluoranyl)ethanoic acid N-[2-[1-(4-bromophenyl)-4-oxo-1,3,8-triazaspiro[4.5]decan-8-yl]ethyl]naphthalene-2-carboxamide;2,2,2-trifluoroacetic acid cid_46939673
Type:
Small organic molecule
Emp. Form.:
C26H27BrN4O2
Mol. Mass.:
507.422
SMILES:
Brc1ccc(cc1)N1CNC(=O)C11CCN(CCNC(=O)c2ccc3ccccc3c2)CC1
: