Target
Phospholipase D1
Ligand
BDBM87196
Substrate
Meas. Tech.
Cellular PLD1 concentration response
IC50
2800±n/a nM
Citation
 PubChem, PC Cellular PLD1 concentration response PubChem Bioassay (2011)[AID] 
Target
Name:
Phospholipase D1
Synonyms:
Choline phosphatase 1 PLD1 Phosphatidylcholine-hydrolyzing phospholipase D1 Phospholipase D1 Phospholipase D2 (PLD2) | hPLD1
Type:
Protein
Mol. Mass.:
124219.92
Organism:
Homo sapiens (Human)
Description:
Q13393
Residue:
1074
  
Inhibitor
Name:
BDBM87196
Synonyms:
N-[(1S)-1-benzyl-2-[4-(2-keto-3H-benzimidazol-1-yl)piperidino]ethyl]quinoline-3-carboxamide N-[(2S)-1-[4-(2-oxo-3H-benzimidazol-1-yl)-1-piperidinyl]-3-phenylpropan-2-yl]-3-quinolinecarboxamide VU0361545-1 | cid_53470155
Type:
Small organic molecule
Emp. Form.:
C31H31N5O2
Mol. Mass.:
505.6101
SMILES:
O=C(N[C@H](CN1CCC(CC1)n1c2ccccc2[nH]c1=O)Cc1ccccc1)c1cnc2ccccc2c1
: