Target
Phospholipase D1
Ligand
BDBM87204
Substrate
Meas. Tech.
Cellular PLD1 concentration response
IC50
121±n/a nM
Citation
 PubChem, PC Cellular PLD1 concentration response PubChem Bioassay (2011)[AID] 
Target
Name:
Phospholipase D1
Synonyms:
Choline phosphatase 1 PLD1 Phosphatidylcholine-hydrolyzing phospholipase D1 Phospholipase D1 Phospholipase D2 (PLD2) | hPLD1
Type:
Protein
Mol. Mass.:
124219.92
Organism:
Homo sapiens (Human)
Description:
Q13393
Residue:
1074
  
Inhibitor
Name:
BDBM87204
Synonyms:
N-[(1S)-2-[4-(2-keto-3H-benzimidazol-1-yl)piperidino]-1-methyl-ethyl]-4-(trifluoromethyl)benzamide;2,2,2-trifluoroacetic acid N-[(2S)-1-[4-(2-oxo-3H-benzimidazol-1-yl)-1-piperidinyl]propan-2-yl]-4-(trifluoromethyl)benzamide;2,2,2-trifluoroacetic acid VU0360253-1 | cid_53470175
Type:
Small organic molecule
Emp. Form.:
C23H25F3N4O2
Mol. Mass.:
446.4654
SMILES:
C[C@@H](CN1CCC(CC1)n1c2ccccc2[nH]c1=O)NC(=O)c1ccc(cc1)C(F)(F)F
: