Target
Phospholipase D1
Ligand
BDBM50258181
Substrate
Meas. Tech.
Cellular PLD1 concentration response
IC50
4±n/a nM
Citation
 PubChem, PC Cellular PLD1 concentration response PubChem Bioassay (2011)[AID] 
Target
Name:
Phospholipase D1
Synonyms:
Choline phosphatase 1 PLD1 Phosphatidylcholine-hydrolyzing phospholipase D1 Phospholipase D1 Phospholipase D2 (PLD2) | hPLD1
Type:
Protein
Mol. Mass.:
124219.92
Organism:
Homo sapiens (Human)
Description:
Q13393
Residue:
1074
  
Inhibitor
Name:
BDBM50258181
Synonyms:
3,4-difluoro-N-(2-(4-(6-fluoro-2-oxo-2,3-dihydro-1H-benzo[d]imidazol-1-yl)piperidin-1-yl)ethyl)benzamide cid_44573728
Type:
Small organic molecule
Emp. Form.:
C21H21F3N4O2
Mol. Mass.:
418.4122
SMILES:
Fc1ccc2[nH]c(=O)n(C3CCN(CCNC(=O)c4ccc(F)c(F)c4)CC3)c2c1
: