Target
Phospholipase D1
Ligand
BDBM87238
Substrate
Meas. Tech.
Cellular PLD1 concentration response
IC50
2560±n/a nM
Citation
 PubChem, PC Cellular PLD1 concentration response PubChem Bioassay (2011)[AID] 
Target
Name:
Phospholipase D1
Synonyms:
Choline phosphatase 1 PLD1 Phosphatidylcholine-hydrolyzing phospholipase D1 Phospholipase D1 Phospholipase D2 (PLD2) | hPLD1
Type:
Protein
Mol. Mass.:
124219.92
Organism:
Homo sapiens (Human)
Description:
Q13393
Residue:
1074
  
Inhibitor
Name:
BDBM87238
Synonyms:
(1R,2R)-N-[(1S)-2-(4-keto-1-phenyl-1,3,8-triazaspiro[4.5]decan-8-yl)-1-methyl-ethyl]-2-phenyl-cyclopropanecarboxamide;2,2,2-trifluoroacetic acid (1R,2R)-N-[(2S)-1-(4-oxo-1-phenyl-1,3,8-triazaspiro[4.5]decan-8-yl)propan-2-yl]-2-phenyl-1-cyclopropanecarboxamide;2,2,2-trifluoroacetic acid VU0244608-1 | cid_53470307
Type:
Small organic molecule
Emp. Form.:
C26H32N4O2
Mol. Mass.:
432.5579
SMILES:
C[C@@H](CN1CCC2(CC1)N(CNC2=O)c1ccccc1)NC(=O)[C@@H]1C[C@H]1c1ccccc1
: