Target
Nuclear receptor coactivator 3
Ligand
BDBM62667
Substrate
Meas. Tech.
Luminescence-based cell-based high throughput dose response assay for inhibitors of the Steroid Receptor Coactivator 3 (SRC3; NCOA3)
IC50
>35872±n/a nM
Citation
 PubChem, PC Luminescence-based cell-based high throughput dose response assay for inhibitors of the Steroid Receptor Coactivator 3 (SRC3; NCOA3) PubChem Bioassay (2012)[AID] 
Target
Name:
Nuclear receptor coactivator 3
Synonyms:
AIB1 NCOA3 RAC3 nuclear receptor coactivator 3 isoform a
Type:
Enzyme Catalytic Domain
Mol. Mass.:
155305.29
Organism:
Homo sapiens (Human)
Description:
Q9Y6Q9
Residue:
1424
  
Inhibitor
Name:
BDBM62667
Synonyms:
(phenylmethyl) 2-(1-tert-butyl-4-oxidanylidene-pyrazolo[3,4-d]pyrimidin-5-yl)ethanoate 2-(1-tert-butyl-4-oxo-5-pyrazolo[3,4-d]pyrimidinyl)acetic acid (phenylmethyl) ester SMR000029431 benzyl 2-(1-tert-butyl-4-oxopyrazolo[3,4-d]pyrimidin-5-yl)acetate | cid_3237137
Type:
Small organic molecule
Emp. Form.:
C18H20N4O3
Mol. Mass.:
340.3764
SMILES:
CC(C)(C)n1ncc2c1ncn(CC(=O)OCc1ccccc1)c2=O
: