Target
Nuclear receptor coactivator 3
Ligand
BDBM48212
Substrate
Meas. Tech.
Luminescence-based cell-based high throughput dose response assay for inhibitors of the Steroid Receptor Coactivator 3 (SRC3; NCOA3)
IC50
>35888±n/a nM
Citation
 PubChem, PC Luminescence-based cell-based high throughput dose response assay for inhibitors of the Steroid Receptor Coactivator 3 (SRC3; NCOA3) PubChem Bioassay (2012)[AID] 
Target
Name:
Nuclear receptor coactivator 3
Synonyms:
AIB1 NCOA3 RAC3 nuclear receptor coactivator 3 isoform a
Type:
Enzyme Catalytic Domain
Mol. Mass.:
155305.29
Organism:
Homo sapiens (Human)
Description:
Q9Y6Q9
Residue:
1424
  
Inhibitor
Name:
BDBM48212
Synonyms:
3-(4-Methoxy-phenyl)-7-piperidin-1-yl-isothiazolo[4,5-d]pyrimidine 3-(4-methoxyphenyl)-7-piperidin-1-yl-[1,2]thiazolo[4,5-d]pyrimidine MLS000067913 cid_1462058
Type:
Small organic molecule
Emp. Form.:
C17H18N4OS
Mol. Mass.:
326.416
SMILES:
COc1ccc(cc1)-c1nsc2c(ncnc12)N1CCCCC1
: