Target
Nuclear receptor coactivator 3
Ligand
BDBM87272
Substrate
Meas. Tech.
Luminescence-based cell-based high throughput dose response assay for inhibitors of the Steroid Receptor Coactivator 3 (SRC3; NCOA3)
IC50
10901±n/a nM
Citation
 PubChem, PC Luminescence-based cell-based high throughput dose response assay for inhibitors of the Steroid Receptor Coactivator 3 (SRC3; NCOA3) PubChem Bioassay (2012)[AID] 
Target
Name:
Nuclear receptor coactivator 3
Synonyms:
AIB1 NCOA3 RAC3 nuclear receptor coactivator 3 isoform a
Type:
Enzyme Catalytic Domain
Mol. Mass.:
155305.29
Organism:
Homo sapiens (Human)
Description:
Q9Y6Q9
Residue:
1424
  
Inhibitor
Name:
BDBM87272
Synonyms:
2-(N-mesyl-2-methyl-5-nitro-anilino)-N-[4-[(2-methoxy-5-methyl-phenyl)sulfamoyl]phenyl]acetamide N-[4-[(2-methoxy-5-methyl-phenyl)sulfamoyl]phenyl]-2-[(2-methyl-5-nitro-phenyl)-methylsulfonyl-amino]ethanamide N~1~-(4-{[(2-methoxy-5-methylphenyl)amino]sulfonyl}phenyl)-N~2~-(2-methyl-5-nitrophenyl)-N~2~-(methylsulfonyl)glycinamide cid_2199765
Type:
Small organic molecule
Emp. Form.:
C24H26N4O8S2
Mol. Mass.:
562.615
SMILES:
COc1ccc(C)cc1NS(=O)(=O)c1ccc(NC(=O)CN(c2cc(ccc2C)[N+]([O-])=O)S(C)(=O)=O)cc1
: