Target
Nuclear receptor coactivator 3
Ligand
BDBM58977
Substrate
Meas. Tech.
Luminescence-based cell-based high throughput dose response assay for inhibitors of the Steroid Receptor Coactivator 3 (SRC3; NCOA3)
IC50
>35870±n/a nM
Citation
 PubChem, PC Luminescence-based cell-based high throughput dose response assay for inhibitors of the Steroid Receptor Coactivator 3 (SRC3; NCOA3) PubChem Bioassay (2012)[AID] 
Target
Name:
Nuclear receptor coactivator 3
Synonyms:
AIB1 NCOA3 RAC3 nuclear receptor coactivator 3 isoform a
Type:
Enzyme Catalytic Domain
Mol. Mass.:
155305.29
Organism:
Homo sapiens (Human)
Description:
Q9Y6Q9
Residue:
1424
  
Inhibitor
Name:
BDBM58977
Synonyms:
5-tert-Butyl-2-phenyl-2H-pyrazole-3-carboxylic acid (4-hydroxy-benzylidene)-hydrazide 5-tert-butyl-N'-[(4-oxidanylidenecyclohexa-2,5-dien-1-ylidene)methyl]-2-phenyl-pyrazole-3-carbohydrazide 5-tert-butyl-N'-[(4-oxocyclohexa-2,5-dien-1-ylidene)methyl]-2-phenylpyrazole-3-carbohydrazide SMR000171552 | cid_5758009
Type:
Small organic molecule
Emp. Form.:
C21H22N4O2
Mol. Mass.:
362.425
SMILES:
CC(C)(C)c1cc(C(=O)NN=Cc2ccc(O)cc2)n(n1)-c1ccccc1
: