Target
Nuclear receptor coactivator 3
Ligand
BDBM87277
Substrate
Meas. Tech.
Luminescence-based cell-based high throughput dose response assay for inhibitors of the Steroid Receptor Coactivator 3 (SRC3; NCOA3)
IC50
>35907±n/a nM
Citation
 PubChem, PC Luminescence-based cell-based high throughput dose response assay for inhibitors of the Steroid Receptor Coactivator 3 (SRC3; NCOA3) PubChem Bioassay (2012)[AID] 
Target
Name:
Nuclear receptor coactivator 3
Synonyms:
AIB1 NCOA3 RAC3 nuclear receptor coactivator 3 isoform a
Type:
Enzyme Catalytic Domain
Mol. Mass.:
155305.29
Organism:
Homo sapiens (Human)
Description:
Q9Y6Q9
Residue:
1424
  
Inhibitor
Name:
BDBM87277
Synonyms:
4-chloranyl-7,8-dimethoxy-5H-pyrimido[5,4-b]indole 4-chloro-7,8-dimethoxy-5H-pyrimido[5,4-b]indole SMR000212519 | cid_5424409
Type:
Small organic molecule
Emp. Form.:
C12H10ClN3O2
Mol. Mass.:
263.68
SMILES:
COc1cc2[nH]c3c(Cl)ncnc3c2cc1OC
: