Target
Nuclear receptor coactivator 3
Ligand
BDBM87281
Substrate
Meas. Tech.
Luminescence-based cell-based high throughput dose response assay for inhibitors of the Steroid Receptor Coactivator 3 (SRC3; NCOA3)
IC50
>35864±n/a nM
Citation
 PubChem, PC Luminescence-based cell-based high throughput dose response assay for inhibitors of the Steroid Receptor Coactivator 3 (SRC3; NCOA3) PubChem Bioassay (2012)[AID] 
Target
Name:
Nuclear receptor coactivator 3
Synonyms:
AIB1 NCOA3 RAC3 nuclear receptor coactivator 3 isoform a
Type:
Enzyme Catalytic Domain
Mol. Mass.:
155305.29
Organism:
Homo sapiens (Human)
Description:
Q9Y6Q9
Residue:
1424
  
Inhibitor
Name:
BDBM87281
Synonyms:
MLS000335684 N-[4-[2-[1-(2-fluorophenyl)-2,5-dimethylpyrrol-3-yl]-2-oxoethyl]sulfanylphenyl]acetamide N-[4-[[2-[1-(2-fluorophenyl)-2,5-dimethyl-pyrrol-3-yl]-2-keto-ethyl]thio]phenyl]acetamide cid_2111906
Type:
Small organic molecule
Emp. Form.:
C22H21FN2O2S
Mol. Mass.:
396.478
SMILES:
CC(=O)Nc1ccc(SCC(=O)c2cc(C)n(c2C)-c2ccccc2F)cc1
: