Target
Nuclear receptor coactivator 3
Ligand
BDBM87297
Substrate
Meas. Tech.
Luminescence-based cell-based high throughput dose response assay for inhibitors of the Steroid Receptor Coactivator 3 (SRC3; NCOA3)
IC50
>35868±n/a nM
Citation
 PubChem, PC Luminescence-based cell-based high throughput dose response assay for inhibitors of the Steroid Receptor Coactivator 3 (SRC3; NCOA3) PubChem Bioassay (2012)[AID] 
Target
Name:
Nuclear receptor coactivator 3
Synonyms:
AIB1 NCOA3 RAC3 nuclear receptor coactivator 3 isoform a
Type:
Enzyme Catalytic Domain
Mol. Mass.:
155305.29
Organism:
Homo sapiens (Human)
Description:
Q9Y6Q9
Residue:
1424
  
Inhibitor
Name:
BDBM87297
Synonyms:
(4Z)-4-[(5-methyl-1-phenyl-pyrazol-4-yl)-oxidanyl-methylidene]-5-pyridin-2-yl-1-(pyridin-3-ylmethyl)pyrrolidine-2,3-dione (4Z)-4-[hydroxy-(5-methyl-1-phenyl-pyrazol-4-yl)methylene]-5-(2-pyridyl)-1-(3-pyridylmethyl)pyrrolidine-2,3-quinone 3-hydroxy-4-[(5-methyl-1-phenyl-1H-pyrazol-4-yl)carbonyl]-5-(2-pyridinyl)-1-(3-pyridinylmethyl)-1,5-dihydro-2H-pyrrol-2-one SMR000293455 | cid_16189420
Type:
Small organic molecule
Emp. Form.:
C26H21N5O3
Mol. Mass.:
451.4766
SMILES:
Cc1c(cnn1-c1ccccc1)C(=O)C1C(N(Cc2cccnc2)C(=O)C1=O)c1ccccn1
: