Target
Nuclear receptor coactivator 3
Ligand
BDBM87298
Substrate
Meas. Tech.
Luminescence-based cell-based high throughput dose response assay for inhibitors of the Steroid Receptor Coactivator 3 (SRC3; NCOA3)
IC50
6451±n/a nM
Citation
 PubChem, PC Luminescence-based cell-based high throughput dose response assay for inhibitors of the Steroid Receptor Coactivator 3 (SRC3; NCOA3) PubChem Bioassay (2012)[AID] 
Target
Name:
Nuclear receptor coactivator 3
Synonyms:
AIB1 NCOA3 RAC3 nuclear receptor coactivator 3 isoform a
Type:
Enzyme Catalytic Domain
Mol. Mass.:
155305.29
Organism:
Homo sapiens (Human)
Description:
Q9Y6Q9
Residue:
1424
  
Inhibitor
Name:
BDBM87298
Synonyms:
MLS000689901 N-(4-hydroxyphenyl)-4-[(5E)-5-[(4-methylphenyl)methylidene]-4-oxidanylidene-2-sulfanylidene-1,3-thiazolidin-3-yl]butanamide N-(4-hydroxyphenyl)-4-[(5E)-5-[(4-methylphenyl)methylidene]-4-oxo-2-sulfanylidene-3-thiazolidinyl]butanamide SMR000298592 | cid_1346846
Type:
Small organic molecule
Emp. Form.:
C21H20N2O3S2
Mol. Mass.:
412.525
SMILES:
Cc1ccc(\C=C2\SC(=S)N(CCCC(=O)Nc3ccc(O)cc3)C2=O)cc1
: