Target
Nuclear receptor coactivator 3
Ligand
BDBM63687
Substrate
Meas. Tech.
Luminescence-based cell-based high throughput dose response assay for inhibitors of the Steroid Receptor Coactivator 3 (SRC3; NCOA3)
IC50
5576±n/a nM
Citation
 PubChem, PC Luminescence-based cell-based high throughput dose response assay for inhibitors of the Steroid Receptor Coactivator 3 (SRC3; NCOA3) PubChem Bioassay (2012)[AID] 
Target
Name:
Nuclear receptor coactivator 3
Synonyms:
AIB1 NCOA3 RAC3 nuclear receptor coactivator 3 isoform a
Type:
Enzyme Catalytic Domain
Mol. Mass.:
155305.29
Organism:
Homo sapiens (Human)
Description:
Q9Y6Q9
Residue:
1424
  
Inhibitor
Name:
BDBM63687
Synonyms:
2-chloranyl-N-(1,2-diphenylethyl)ethanamide MLS001007523 cid_4425285
Type:
Small organic molecule
Emp. Form.:
C16H16ClNO
Mol. Mass.:
273.757
SMILES:
ClCC(=O)NC(Cc1ccccc1)c1ccccc1
: