Target
Nuclear receptor coactivator 3
Ligand
BDBM63729
Substrate
Meas. Tech.
Luminescence-based cell-based high throughput dose response assay for inhibitors of the Steroid Receptor Coactivator 3 (SRC3; NCOA3)
IC50
8702±n/a nM
Citation
 PubChem, PC Luminescence-based cell-based high throughput dose response assay for inhibitors of the Steroid Receptor Coactivator 3 (SRC3; NCOA3) PubChem Bioassay (2012)[AID] 
Target
Name:
Nuclear receptor coactivator 3
Synonyms:
AIB1 NCOA3 RAC3 nuclear receptor coactivator 3 isoform a
Type:
Enzyme Catalytic Domain
Mol. Mass.:
155305.29
Organism:
Homo sapiens (Human)
Description:
Q9Y6Q9
Residue:
1424
  
Inhibitor
Name:
BDBM63729
Synonyms:
2-chloranyl-N-cyclohexyl-N-phenyl-ethanamide 2-chloro-N-cyclohexyl-N-phenylacetamide SMR000376529 | cid_2794916
Type:
Small organic molecule
Emp. Form.:
C14H18ClNO
Mol. Mass.:
251.752
SMILES:
ClCC(=O)N(C1CCCCC1)c1ccccc1
: