Target
Nuclear receptor coactivator 3
Ligand
BDBM63772
Substrate
Meas. Tech.
Luminescence-based cell-based high throughput dose response assay for inhibitors of the Steroid Receptor Coactivator 3 (SRC3; NCOA3)
IC50
13674±n/a nM
Citation
 PubChem, PC Luminescence-based cell-based high throughput dose response assay for inhibitors of the Steroid Receptor Coactivator 3 (SRC3; NCOA3) PubChem Bioassay (2012)[AID] 
Target
Name:
Nuclear receptor coactivator 3
Synonyms:
AIB1 NCOA3 RAC3 nuclear receptor coactivator 3 isoform a
Type:
Enzyme Catalytic Domain
Mol. Mass.:
155305.29
Organism:
Homo sapiens (Human)
Description:
Q9Y6Q9
Residue:
1424
  
Inhibitor
Name:
BDBM63772
Synonyms:
3-[(5Z)-4-oxidanylidene-5-[(4-prop-2-enoxyphenyl)methylidene]-2-sulfanylidene-1,3-thiazolidin-3-yl]propanoic acid 3-[(5Z)-4-oxo-5-[(4-prop-2-enoxyphenyl)methylidene]-2-sulfanylidene-3-thiazolidinyl]propanoic acid 3-{5-[1-(4-Allyloxy-phenyl)-meth-(Z)-ylidene]-4-oxo-2-thioxo-thiazolidin-3-yl}-propionic acid SMR000414732 | cid_1611092
Type:
Small organic molecule
Emp. Form.:
C16H15NO4S2
Mol. Mass.:
349.425
SMILES:
OC(=O)CCN1C(=S)S\C(=C/c2ccc(OCC=C)cc2)C1=O
: