Target
Nuclear receptor coactivator 3
Ligand
BDBM64729
Substrate
Meas. Tech.
Luminescence-based cell-based high throughput dose response assay for inhibitors of the Steroid Receptor Coactivator 3 (SRC3; NCOA3)
IC50
4709±n/a nM
Citation
 PubChem, PC Luminescence-based cell-based high throughput dose response assay for inhibitors of the Steroid Receptor Coactivator 3 (SRC3; NCOA3) PubChem Bioassay (2012)[AID] 
Target
Name:
Nuclear receptor coactivator 3
Synonyms:
AIB1 NCOA3 RAC3 nuclear receptor coactivator 3 isoform a
Type:
Enzyme Catalytic Domain
Mol. Mass.:
155305.29
Organism:
Homo sapiens (Human)
Description:
Q9Y6Q9
Residue:
1424
  
Inhibitor
Name:
BDBM64729
Synonyms:
MLS001212967 N-[(2,4-dichlorophenyl)-(8-hydroxy-7-quinolyl)methyl]valeramide N-[(2,4-dichlorophenyl)-(8-oxidanylquinolin-7-yl)methyl]pentanamide SMR000517136 | cid_2922048
Type:
Small organic molecule
Emp. Form.:
C21H20Cl2N2O2
Mol. Mass.:
403.302
SMILES:
CCCCC(=O)NC(c1ccc(Cl)cc1Cl)c1ccc2cccnc2c1O
: