Target
Nuclear receptor coactivator 3
Ligand
BDBM87335
Substrate
Meas. Tech.
Luminescence-based cell-based high throughput dose response assay for inhibitors of the Steroid Receptor Coactivator 3 (SRC3; NCOA3)
IC50
7714±n/a nM
Citation
 PubChem, PC Luminescence-based cell-based high throughput dose response assay for inhibitors of the Steroid Receptor Coactivator 3 (SRC3; NCOA3) PubChem Bioassay (2012)[AID] 
Target
Name:
Nuclear receptor coactivator 3
Synonyms:
AIB1 NCOA3 RAC3 nuclear receptor coactivator 3 isoform a
Type:
Enzyme Catalytic Domain
Mol. Mass.:
155305.29
Organism:
Homo sapiens (Human)
Description:
Q9Y6Q9
Residue:
1424
  
Inhibitor
Name:
BDBM87335
Synonyms:
(4-methoxyphenyl)methyl 4-(4-fluorophenyl)-6-methyl-2-oxidanylidene-3,4-dihydro-1H-pyrimidine-5-carboxylate 4-(4-Fluoro-phenyl)-6-methyl-2-oxo-1,2,3,4-tetrahydro-pyrimidine-5-carboxylic acid 4-methoxy-benzyl ester 4-(4-fluorophenyl)-6-methyl-2-oxo-3,4-dihydro-1H-pyrimidine-5-carboxylic acid (4-methoxyphenyl)methyl ester SMR000515713 | cid_2855521
Type:
Small organic molecule
Emp. Form.:
C20H19FN2O4
Mol. Mass.:
370.3743
SMILES:
COc1ccc(COC(=O)C2C(NC(=O)N=C2C)c2ccc(F)cc2)cc1
: