Target
Nuclear receptor coactivator 3
Ligand
BDBM87337
Substrate
Meas. Tech.
Luminescence-based cell-based high throughput dose response assay for inhibitors of the Steroid Receptor Coactivator 3 (SRC3; NCOA3)
IC50
7515±n/a nM
Citation
 PubChem, PC Luminescence-based cell-based high throughput dose response assay for inhibitors of the Steroid Receptor Coactivator 3 (SRC3; NCOA3) PubChem Bioassay (2012)[AID] 
Target
Name:
Nuclear receptor coactivator 3
Synonyms:
AIB1 NCOA3 RAC3 nuclear receptor coactivator 3 isoform a
Type:
Enzyme Catalytic Domain
Mol. Mass.:
155305.29
Organism:
Homo sapiens (Human)
Description:
Q9Y6Q9
Residue:
1424
  
Inhibitor
Name:
BDBM87337
Synonyms:
4-[2-(2,2,6-trimethyl-8-oxidanylidene-3,4-dihydropyrano[3,2-g]chromen-7-yl)ethanoylamino]butanoic acid 4-[[2-(2,2,6-trimethyl-8-oxo-3,4-dihydropyrano[3,2-g]chromen-7-yl)acetyl]amino]butanoic acid MLS001201785 cid_8016512
Type:
Small organic molecule
Emp. Form.:
C21H25NO6
Mol. Mass.:
387.4263
SMILES:
Cc1c(CC(=O)NCCCC(O)=O)c(=O)oc2cc3OC(C)(C)CCc3cc12
: