Target
Nuclear receptor coactivator 3
Ligand
BDBM64122
Substrate
Meas. Tech.
Luminescence-based cell-based high throughput dose response assay for inhibitors of the Steroid Receptor Coactivator 3 (SRC3; NCOA3)
IC50
>35892±n/a nM
Citation
 PubChem, PC Luminescence-based cell-based high throughput dose response assay for inhibitors of the Steroid Receptor Coactivator 3 (SRC3; NCOA3) PubChem Bioassay (2012)[AID] 
Target
Name:
Nuclear receptor coactivator 3
Synonyms:
AIB1 NCOA3 RAC3 nuclear receptor coactivator 3 isoform a
Type:
Enzyme Catalytic Domain
Mol. Mass.:
155305.29
Organism:
Homo sapiens (Human)
Description:
Q9Y6Q9
Residue:
1424
  
Inhibitor
Name:
BDBM64122
Synonyms:
(5Z)-5-(2-fluorobenzylidene)-2-(4-methylpiperidin-1-yl)-1,3-thiazol-4(5H)-one (5Z)-5-[(2-fluorophenyl)methylidene]-2-(4-methyl-1-piperidinyl)-4-thiazolone MLS001196513 cid_24761375
Type:
Small organic molecule
Emp. Form.:
C16H17FN2OS
Mol. Mass.:
304.382
SMILES:
CC1CCN(CC1)C1=NC(=O)\C(S1)=C\c1ccccc1F
: