Target
Nuclear receptor coactivator 3
Ligand
BDBM72898
Substrate
Meas. Tech.
Luminescence-based cell-based high throughput dose response assay for inhibitors of the Steroid Receptor Coactivator 3 (SRC3; NCOA3)
IC50
10685±n/a nM
Citation
 PubChem, PC Luminescence-based cell-based high throughput dose response assay for inhibitors of the Steroid Receptor Coactivator 3 (SRC3; NCOA3) PubChem Bioassay (2012)[AID] 
Target
Name:
Nuclear receptor coactivator 3
Synonyms:
AIB1 NCOA3 RAC3 nuclear receptor coactivator 3 isoform a
Type:
Enzyme Catalytic Domain
Mol. Mass.:
155305.29
Organism:
Homo sapiens (Human)
Description:
Q9Y6Q9
Residue:
1424
  
Inhibitor
Name:
BDBM72898
Synonyms:
2,4,5,6-tetrachloro-N-(phenylmethyl)-3-pyridinecarboxamide MLS001202192 N-benzyl-2,4,5,6-tetrachloronicotinamide SMR000565083 | cid_628678
Type:
Small organic molecule
Emp. Form.:
C13H8Cl4N2O
Mol. Mass.:
350.027
SMILES:
Clc1nc(Cl)c(C(=O)NCc2ccccc2)c(Cl)c1Cl
: