Target
Nuclear receptor coactivator 3
Ligand
BDBM80062
Substrate
Meas. Tech.
Luminescence-based cell-based high throughput dose response assay for inhibitors of the Steroid Receptor Coactivator 3 (SRC3; NCOA3)
IC50
>11959±n/a nM
Citation
 PubChem, PC Luminescence-based cell-based high throughput dose response assay for inhibitors of the Steroid Receptor Coactivator 3 (SRC3; NCOA3) PubChem Bioassay (2012)[AID] 
Target
Name:
Nuclear receptor coactivator 3
Synonyms:
AIB1 NCOA3 RAC3 nuclear receptor coactivator 3 isoform a
Type:
Enzyme Catalytic Domain
Mol. Mass.:
155305.29
Organism:
Homo sapiens (Human)
Description:
Q9Y6Q9
Residue:
1424
  
Inhibitor
Name:
BDBM80062
Synonyms:
2-[(Z)-1-(benzenesulfonyl)-2-[4-(trifluoromethyl)phenyl]ethenyl]-1H-benzimidazole 2-[(Z)-1-besyl-2-[4-(trifluoromethyl)phenyl]vinyl]-1H-benzimidazole SMR001544541 | cid_44601668
Type:
Small organic molecule
Emp. Form.:
C22H15F3N2O2S
Mol. Mass.:
428.427
SMILES:
FC(F)(F)c1ccc(\C=C(\c2nc3ccccc3[nH]2)S(=O)(=O)c2ccccc2)cc1
: