Target
Tegument protein VP16
Ligand
BDBM87264
Substrate
Meas. Tech.
Counterscreen for inhibitors of the Steroid Receptor Coactivator 3 (SRC3; NCOA3)
IC50
9841±n/a nM
Citation
 PubChem, PC Counterscreen for inhibitors of the Steroid Receptor Coactivator 3 (SRC3; NCOA3): Luminescence-based cell-based high throughput dose response assay to identify inhibitors of the Herpes Virus Virion Protein 16 (VP16) PubChem Bioassay (2012)[AID] 
Target
Name:
Tegument protein VP16
Synonyms:
Alpha trans-inducing protein (VP16) transactivating tegument protein VP16
Type:
PROTEIN
Mol. Mass.:
54325.13
Organism:
Human herpesvirus 1 (strain 17) (HHV-1) (Human herpes simplex virus1)
Description:
EBI_100271
Residue:
490
  
Inhibitor
Name:
BDBM87264
Synonyms:
1-[3-(3-methylbut-2-enyl)-4-oxidanyl-phenyl]propan-1-one 1-[4-hydroxy-3-(3-methylbut-2-enyl)phenyl]-1-propanone MLS000541220 cid_902152
Type:
Small organic molecule
Emp. Form.:
C14H18O2
Mol. Mass.:
218.2915
SMILES:
[#6]-[#6]-[#6](=O)-c1ccc(-[#8])c(-[#6]\[#6]=[#6](\[#6])-[#6])c1
: