Target
Tegument protein VP16
Ligand
BDBM41953
Substrate
Meas. Tech.
Counterscreen for inhibitors of the Steroid Receptor Coactivator 3 (SRC3; NCOA3)
IC50
7551±n/a nM
Citation
 PubChem, PC Counterscreen for inhibitors of the Steroid Receptor Coactivator 3 (SRC3; NCOA3): Luminescence-based cell-based high throughput dose response assay to identify inhibitors of the Herpes Virus Virion Protein 16 (VP16) PubChem Bioassay (2012)[AID] 
Target
Name:
Tegument protein VP16
Synonyms:
Alpha trans-inducing protein (VP16) transactivating tegument protein VP16
Type:
PROTEIN
Mol. Mass.:
54325.13
Organism:
Human herpesvirus 1 (strain 17) (HHV-1) (Human herpes simplex virus1)
Description:
EBI_100271
Residue:
490
  
Inhibitor
Name:
BDBM41953
Synonyms:
4-(3,5-dimethylpiperidin-1-yl)sulfonyl-N'-(4-methyl-1,3-benzothiazol-2-yl)benzohydrazide 4-[(3,5-dimethyl-1-piperidinyl)sulfonyl]-N'-(4-methyl-1,3-benzothiazol-2-yl)benzohydrazide SMR000235764 | cid_12006167
Type:
Small organic molecule
Emp. Form.:
C22H26N4O3S2
Mol. Mass.:
458.597
SMILES:
CC1CC(C)CN(C1)S(=O)(=O)c1ccc(cc1)C(=O)NNc1nc2c(C)cccc2s1
: